L-Alanine, N(O,S)-ethoxycarbonyl, (S)-(+)-3-methyl-2-butyl ester

Van Den Dool and Kratz RI, non-polar column, custom temperature program

Data compiled by: NIST Mass Spectrometry Data Center, William E. Wallace, director

Column type Capillary
Active phase DB-5
Column length (m) 30.
Carrier gas He
Substrate
Column diameter (mm) 0.25
Phase thickness (μm) 0.25
Program 60C(1min) => 30C/min => 120C(2min) => 3C/min => 280C
I 1473.3
ReferenceLee, Kim, et al., 2001
Comment MSDC-RI

References

Lee, Kim, et al., 2001
Lee, J.; Kim, K.-R.; Won, S.; Kim, J.H.; Goto, J., Enantioseparation of chiral amino acids as the N(O,S)-ethoxycarbonylated diastereomeric esters by achiral dual-capillary column gas chromatography, Analyst, 2001, 126, 12, 2128-2133, https://doi.org/10.1039/b106610m . [all data]