13,16-Dimethyloctacosane

Normal alkane RI, non-polar column, custom temperature program

View large format table.

Column type Active phase I Reference Comment
CapillaryPolydimethyl siloxane2912.Schouten, Hopmans, et al., 2000Program: not specified

References

Schouten, Hopmans, et al., 2000
Schouten, S.; Hopmans, E.C.; Pancost, R.D.; Damsté, J.S.S., Widespread occurrence of structurally diverse tetraether membrane lipids: evidence for the ubiquitous presence of low-temperature relatives of hyperthermophiles, Proc. Nat. Acad. Sci. U.S.A., 2000, 97, 26, 14421-14426, https://doi.org/10.1073/pnas.97.26.14421 . [all data]