Z-9,11-dodecadienal

Van Den Dool and Kratz RI, non-polar column, custom temperature program

View large format table.

Column type Active phase I Reference Comment
CapillaryDB-51436.Sasaerila, Gries, et al., 2000Column length: 30. m; Program: not specified

References

Sasaerila, Gries, et al., 2000
Sasaerila, Y.; Gries, R.; Gries, G.; Khaskin, G.; Hardi, Sex pheromone components of nettle caterpillar, Setora nitens, J. Chem. Ecol., 2000, 26, 8, 1983-1990, https://doi.org/10.1023/A:1005513211225 . [all data]