(3R,4S)-3-Azido-4-tert-butyldimethylsilyloxy-1-tert-butoxycarbonylazepane

Normal alkane RI, non-polar column, custom temperature program

View large format table.

Column type Active phase I Reference Comment
CapillaryOptima-52089.Herdeis, Mohareb, et al., 199925. m/0.2 mm/0.1 μm, He; Program: not specified

References

Herdeis, Mohareb, et al., 1999
Herdeis, C.; Mohareb, R.M.; Neder, R.B.; Schwabenländer, F.; Telser, J., Studies on the synthesis of chiral nonracemic 3,4-disubstituted azepanes, a formal synthesis of (+)- and (-)-balanol, Tetrahedron: Asymmetry, 1999, 10, 23, 4521-4537, https://doi.org/10.1016/S0957-4166(99)00466-8 . [all data]