1,7-Heptanediol, dinitrate

Normal alkane RI, non-polar column, temperature ramp

Data compiled by: NIST Mass Spectrometry Data Center, William E. Wallace, director

Column type Capillary
Active phase DB-1
Column length (m)
Carrier gas
Substrate
Column diameter (mm)
Phase thickness (μm)
Tstart (C) 40.
Tend (C) 250.
Heat rate (K/min) 3.
Initial hold (min) 3.
Final hold (min)
I 1543.
ReferenceSchneider and Ballschniter, 1996
Comment MSDC-RI

References

Schneider and Ballschniter, 1996
Schneider, M.; Ballschniter, K., Separation of Diastereomeric and Enentiomeric Alkyl Nitrates - Systematic Approach to Chiral Discrimination on Cyclodextrin LIPODEX-D, Chem. Eur. J., 1996, 2, 5, 539-544, https://doi.org/10.1002/chem.19960020513 . [all data]