2,6,10,14,18-Pentamethyl-7-(3-methyl-pentyl)-nonadecane

Normal alkane RI, non-polar column, custom temperature program

View large format table.

Column type Active phase I Reference Comment
CapillaryCP Sil 5 CB2525.Hoefs, Sinninghe Damsté, et al., 199525. m/0.32 mm/0.2 μm, He; Program: 70C => 20C/min => 130C => 4C/min => 320C(10min)

References

Hoefs, Sinninghe Damsté, et al., 1995
Hoefs, M.J.L.; Sinninghe Damsté, J.S.; de Leeuw, J.W., A novel C35 highly branched isoprenoid polyene in recent Indian Ocean sediments, Org. Geochem., 1995, 23, 3, 263-267, https://doi.org/10.1016/0146-6380(95)00031-9 . [all data]