2-(2-Butenylidene)-3,3-dimethyl-5-(2-oxopropyl)tetrahydrofuran, diastereomer 2

Normal alkane RI, polar column, temperature ramp

View large format table.

Column type Active phase I Reference Comment
CapillaryDB-Wax2099.Neugebauer, Winterhalter, et al., 199430. m/0.259 mm/0.25 μm, He, 50. C @ 3. min, 4. K/min; Tend: 240. C

References

Neugebauer, Winterhalter, et al., 1994
Neugebauer, W.; Winterhalter, P.; Schreier, P., 2-(2-Butenylidene)-3,3-dimethyl-5-(2-oxopropyl)tetrahydrofuran: A New Degradation Product of 3-Hydroxy-5,6-epoxy-β-ionol, J. Agric. Food Chem., 1994, 42, 12, 2885-2888, https://doi.org/10.1021/jf00048a044 . [all data]