2-acetyl-5-formylfuran

Kovats' RI, non-polar column, isothermal

View large format table.

Column type Active phase Temperature (C) I Reference Comment
CapillarySPB-1100.1118.Misharina, Beletsky, et al., 199460. m/0.32 mm/0.25 μm

Van Den Dool and Kratz RI, non-polar column, temperature ramp

View large format table.

Column type Active phase I Reference Comment
CapillarySPB-11116.Misharina, Beletsky, et al., 199460. m/0.32 mm/0.25 μm, 8. K/min; Tstart: 50. C; Tend: 200. C

References

Misharina, Beletsky, et al., 1994
Misharina, T.A.; Beletsky, I.V.; Golovnya, R.V., Chromatographic and IR characteristics of methyl-, formyl-, and acetyl-substituted furans and thiophenes, Russ. Chem. Bull. (Engl. Transl.), 1994, 43, 1, 64-69, https://doi.org/10.1007/BF00699137 . [all data]