5-(3,5-dimethylheptanyl)-3-methyl-2H-pyran-2-one, diastereomer 2

Van Den Dool and Kratz RI, non-polar column, temperature ramp

View large format table.

Column type Active phase I Reference Comment
CapillarySE-301851.Charlton, Webster, et al., 199330. m/0.25 mm/0.25 μm, He, 80. C @ 2. min, 8. K/min, 230. C @ 20. min

Van Den Dool and Kratz RI, polar column, temperature ramp

View large format table.

Column type Active phase I Reference Comment
CapillaryCarbowax2592.Charlton, Webster, et al., 199330. m/0.25 mm/0.25 μm, He, 80. C @ 2. min, 10. K/min, 240. C @ 20. min

References

Charlton, Webster, et al., 1993
Charlton, R.E.; Webster, F.X.; Zhang, A.; Schal, C.; Liang, D.; Sreng, I.; Roelofs, W.L., Sex pheromone for the brownbanded cockroach is an unusual dialkyl-substituted α-pyrone, Proc. Natl. Acad. Sci. U.S.A, 1993, 90, 21, 10202-10205, https://doi.org/10.1073/pnas.90.21.10202 . [all data]