ethyl-α-ketobutyrate

Van Den Dool and Kratz RI, non-polar column, temperature ramp

View large format table.

Column type Active phase I Reference Comment
CapillarySE-301028.Misharina, Golovnya, et al., 199150. m/0.32 mm/0.25 μm, 4. K/min; Tstart: 50. C; Tend: 240. C

References

Misharina, Golovnya, et al., 1991
Misharina, T.A.; Golovnya, R.V.; Yakovleva, V.N.; Vitt, S.V., Pyrazines formed in model glycerin-water systems, Russ. Chem. Bull. (Engl. Transl.), 1991, 40, 9, 1742-1748, https://doi.org/10.1007/BF00960396 . [all data]