α-acorenal

Kovats' RI, non-polar column, isothermal

View large format table.

Column type Active phase Temperature (C) I Reference Comment
CapillaryDB-5165.1657.Cool, Power, et al., 1991He; Column length: 30. m; Column diameter: 0.2 mm

Kovats' RI, polar column, isothermal

View large format table.

Column type Active phase Temperature (C) I Reference Comment
CapillaryCarbowax 20M165.2135.Cool, Power, et al., 1991He; Column length: 43. m; Column diameter: 0.5 mm

References

Cool, Power, et al., 1991
Cool, L.G.; Power, A.B.; Zavarin, E., Variability of foliage terpenes of Fitzroya cupressoides, Biochem. Syst. Ecol., 1991, 19, 5, 421-432, https://doi.org/10.1016/0305-1978(91)90059-9 . [all data]