3-oxy-4,6-cholenoate, methyl ester-trimethylsilyl ether

Kovats' RI, non-polar column, custom temperature program

View large format table.

Column type Active phase I Reference Comment
CapillarySE-303270.Axelson, Mörk, et al., 199130. m/0.32 mm/0.25 μm; Program: 50C(6min) => rapidly => 190C => 5C/min => 285C

References

Axelson, Mörk, et al., 1991
Axelson, M.; Mörk, B.; Everson, G.T., Bile Acid Synthesis in Cultured Human Hepatoblastoma Cells, J. Biol. Chem., 1991, 266, 27, 17770-17777. [all data]