butyl 4-ethylheptanoate

Normal alkane RI, polar column, temperature ramp

View large format table.

Column type Active phase I Reference Comment
CapillarySupelcowax-101647.Ha and Lindsay, 198960. m/0.32 mm/0.25 μm, He, 50. C @ 15. min, 2. K/min; Tend: 230. C

References

Ha and Lindsay, 1989
Ha, J.K.; Lindsay, R.C., Mass spectra of butyl esters of volatile branched-chain and other fatty acids occurring in milkfat and meat lipids, J. Food Comp. Anal., 1989, 2, 2, 118-131, https://doi.org/10.1016/0889-1575(89)90072-0 . [all data]