3α,4β,7α,12α-tetrahydroxy-5β-cholanoic acid, methyl ester-trimethylsilyl-ether derivative

Van Den Dool and Kratz RI, non-polar column, temperature ramp

Data compiled by: NIST Mass Spectrometry Data Center, William E. Wallace, director

Column type CapillaryCapillary
Active phase DB-1DB-1
Column length (m) 30.30.
Carrier gas HeHe
Substrate
Column diameter (mm)
Phase thickness (μm) 0.250.25
Tstart (C) 225.225.
Tend (C) 295.295.
Heat rate (K/min) 2.2.
Initial hold (min) 5.5.
Final hold (min) 20.20.
I 3462.3462.
ReferenceDumaswala, Setchell, et al., 1989Dumaswala, Setchell, et al., 1989
Comment MSDC-RI MSDC-RI

References

Dumaswala, Setchell, et al., 1989
Dumaswala, R.; Setchell, K.D.R.; Zimmer-Nechemias, L.; Iida, T.; Goto, J.; Nambara, T., Identification of 3α,4β,7α-trihydroxy-5β-cholanoic acid in human bile: reflection of a new pathway in bile acid metabolism in humans, J. Lipid Res., 1989, 30, 847-856. [all data]