meta-Fluorotyrosine, tris-TMS

Normal alkane RI, non-polar column, temperature ramp

View large format table.

Column type Active phase I Reference Comment
CapillaryDB-11945.Berlin, van Huystee, et al., 1989Helium, 6. K/min; Column length: 30. m; Column diameter: 0.30 mm; Tstart: 100. C; Tend: 300. C

References

Berlin, van Huystee, et al., 1989
Berlin, J.; van Huystee, R.B.; Witte, L.; Bender, J.; Jager, H.J.; Wray, V., Characterization of a Meta-Fluorotyrosine-Tolerant Cell Culture of Eschscholtzia californica Cham, Plant Physiol., 1989, 89, 4, 1299-1305, https://doi.org/10.1104/pp.89.4.1299 . [all data]