Humulene diepoxide A

Van Den Dool and Kratz RI, polar column, temperature ramp

View large format table.

Column type Active phase I Reference Comment
CapillaryCarbowax 20M2340.Peppard and Ramus, 198860. m/0.32 mm/0.25 μm; Tstart: 40. C; Tend: 230. C
CapillaryCarbowax 20M2356.Peppard and Ramus, 198860. m/0.32 mm/0.25 μm; Tstart: 40. C; Tend: 230. C
CapillaryCarbowax 20M2358.Peppard and Ramus, 198860. m/0.32 mm/0.25 μm; Tstart: 40. C; Tend: 230. C
CapillaryCarbowax 20M2362.Peppard and Ramus, 198860. m/0.32 mm/0.25 μm; Tstart: 40. C; Tend: 230. C

References

Peppard and Ramus, 1988
Peppard, T.L.; Ramus, S.A., Use of Kovats' gas chromatographic retention indices in beer flavor studies, Am. Soc. Brew. Chem. Proc., 1988, 46, 2, 26-30. [all data]