3,4,5-trimethyl-2[5H]-furanon

Van Den Dool and Kratz RI, polar column, custom temperature program

Data compiled by: NIST Mass Spectrometry Data Center, William E. Wallace, director

Column type CapillaryCapillaryCapillary
Active phase CarbowaxCarbowaxCarbowax
Column length (m)
Carrier gas
Substrate
Column diameter (mm) 0.30.30.3
Phase thickness (μm)
Program not specifiednot specifiednot specified
I 1821.1822.1822.
ReferenceBaltes w. and Bochmann G., 1987Baltes w. and Bochmann G., 1987Baltes w. and Bochmann G., 1987
Comment MSDC-RI MSDC-RI MSDC-RI

References

Baltes w. and Bochmann G., 1987
Baltes w.; Bochmann G., Model reactions on roast aroma formation. II. Mass spectrometric identification of furans and furanones from the reaction of serine and threonine with sucrose under the conditions of coffee roasting, Z. Lebensm. Unters. Forsch., 1987, 184, 179-186. [all data]