6-Heptenylcyclopentane

Kovats' RI, non-polar column, isothermal

View large format table.

Column type Active phase Temperature (C) I Reference Comment
CapillaryOV-1100.1224.7Anders, Anders, et al., 198555. m/0.21 mm/0.35 μm, N2

References

Anders, Anders, et al., 1985
Anders, G.; Anders, K.; Engewald, W., Identification of non-branched alkenylcycloalkanes with a terminal double bond from retention index increments, Chromatographia, 1985, 20, 2, 83-86, https://doi.org/10.1007/BF02280602 . [all data]