(E)-oct-4-en-3-one

Van Den Dool and Kratz RI, polar column, custom temperature program

Data compiled by: NIST Mass Spectrometry Data Center, William E. Wallace, director

Column type Capillary
Active phase Carbowax 20M
Column length (m) 150.
Carrier gas
Substrate
Column diameter (mm) 0.75
Phase thickness (μm)
Program not specified
I 1320.
ReferenceWhitfield, Shea, et al., 1981
Comment MSDC-RI

References

Whitfield, Shea, et al., 1981
Whitfield, F.B.; Shea, S.R.; Gillen, K.J.; Shaw, K.J., Volatile components from the roots of Acacia pulchella R.Br. and their effect on Phytophthora cinnamomi rands, Aust. J. Bot., 1981, 29, 2, 195-208, https://doi.org/10.1071/BT9810195 . [all data]