cis-3,11-heptadecadiene

Kovats' RI, non-polar column, temperature ramp

View large format table.

Column type Active phase I Reference Comment
PackedApiezon L1657.Youngblood, Blumer, et al., 1971Chromosorb W, 4. K/min; Column length: 3.0 m; Tstart: 80. C; Tend: 290. C

Kovats' RI, polar column, temperature ramp

View large format table.

Column type Active phase I Reference Comment
PackedFFAP1780.Youngblood, Blumer, et al., 1971Chromosorb W, 4. K/min; Column length: 3.0 m; Tstart: 80. C; Tend: 290. C

References

Youngblood, Blumer, et al., 1971
Youngblood, W.W.; Blumer, M.; Guillard, R.L.; Fiore, F., Saturated and unsaturated hydrocarbons in marine benthic algae, Marine Biology, 1971, 8, 3, 190-201, https://doi.org/10.1007/BF00355215 . [all data]