Tetrahydrocortisone, MO TMS

Van Den Dool and Kratz RI, non-polar column, temperature ramp

Data compiled by: NIST Mass Spectrometry Data Center, William E. Wallace, director

Column type PackedPacked
Active phase OV-101SE-30
Column length (m) 3.63.6
Carrier gas
Substrate Gas-Chrom P (80-100 mesh)Gas-Chrom P (80-100 mesh)
Column diameter (mm)
Phase thickness (μm)
Tstart (C) 180.180.
Tend (C)
Heat rate (K/min) 1.1.
Initial hold (min)
Final hold (min)
I 2982.2965.
ReferenceHurter and van Ree, 1979Hurter and van Ree, 1979
Comment MSDC-RI MSDC-RI

Normal alkane RI, non-polar column, temperature ramp

Data compiled by: NIST Mass Spectrometry Data Center, William E. Wallace, director

Column type Capillary
Active phase BP-1
Column length (m) 25.
Carrier gas Helium
Substrate
Column diameter (mm) 0.22
Phase thickness (μm)
Tstart (C) 180.
Tend (C) 300.
Heat rate (K/min) 3.
Initial hold (min)
Final hold (min)
I 3016.
ReferenceYong, Pitt, et al., 1988
Comment MSDC-RI

References

Hurter and van Ree, 1979
Hurter, P.; van Ree, T., Programmed-Temperature Gas Chromatography on Mixed Phases. Separation of Steroid Derivatives on Binary Mixtures, J. Chromatogr., 1979, 169, 93-100, https://doi.org/10.1016/0021-9673(75)85034-5 . [all data]