Tetracosane, 4-methyl

Kovats' RI, non-polar column, isothermal

Data compiled by: NIST Mass Spectrometry Data Center, William E. Wallace, director

Column type CapillaryCapillary
Active phase Dexsil 300Dexsil 300
Column length (m) 30.30.
Carrier gas HeHe
Substrate
Column diameter (mm) 0.300.30
Phase thickness (μm)
Temperature (C) 210.220.
I 2456.2456.
ReferenceSzafranek, Kusmierz, et al., 1982Szafranek, Kusmierz, et al., 1982
Comment MSDC-RI MSDC-RI

References

Szafranek, Kusmierz, et al., 1982
Szafranek, J.; Kusmierz, J.; Czerwiec, W., Gas chromatographic-mass spectrometric investigations of high-boiling crude oil alkane fractions, J. Chromatogr., 1982, 245, 2, 219-228, https://doi.org/10.1016/S0021-9673(00)88591-X . [all data]