Hexadecane, 7-nonyl
- Formula: C25H52
- Molecular weight: 352.6804
- IUPAC Standard InChIKey: YCQQFUYHNXFBQV-UHFFFAOYSA-N
- Chemical structure:

Van Den Dool and Kratz RI, non-polar column, temperature ramp

Column type | Active phase | I | Reference | Comment |
---|---|---|---|---|
Capillary | DB-1 | 2349. | Khorasheh, Gray, et al., 1989 | 35. C @ 3. min, 3. K/min; Tend: 300. C |

References

Khorasheh, Gray, et al., 1989
Khorasheh, F.; Gray, M.R.; Selucky, M.L.,
Correlation for Kováts retention index of C9-C26 monoalkyl and polymethyl alkanes and alkenes,
J. Chromatogr., 1989, 481, 1-16, https://doi.org/10.1016/S0021-9673(01)96747-0
. [all data]