Hexadecane, 5-undecyl

Kovats' RI, non-polar column, isothermal

View large format table.

Column type Active phase Temperature (C) I Reference Comment
PackedSE-30220.2560.Freche and Grenier-Loustalot, 1982Chromosorb NAW
PackedSE-30270.2565.Freche and Grenier-Loustalot, 1982Chromosorb NAW

Van Den Dool and Kratz RI, non-polar column, temperature ramp

View large format table.

Column type Active phase I Reference Comment
CapillaryDB-12558.Khorasheh, Gray, et al., 198935. C @ 3. min, 3. K/min; Tend: 300. C

References

Freche and Grenier-Loustalot, 1982
Freche, P.; Grenier-Loustalot, M.-F., Identification d'alcanes lourds (modèles de polyéthylène basse densite) par leur tension de vapeur. Corrélation avec la chromatographie en phase gazeuse, J. Chromatogr., 1982, 238, 2, 327-334, https://doi.org/10.1016/S0021-9673(00)81318-7 . [all data]

Khorasheh, Gray, et al., 1989
Khorasheh, F.; Gray, M.R.; Selucky, M.L., Correlation for Kováts retention index of C9-C26 monoalkyl and polymethyl alkanes and alkenes, J. Chromatogr., 1989, 481, 1-16, https://doi.org/10.1016/S0021-9673(01)96747-0 . [all data]