Dodecane, 3,7-dimethyl

Normal alkane RI, non-polar column, temperature ramp

Data compiled by: NIST Mass Spectrometry Data Center, William E. Wallace, director

Column type Capillary
Active phase CP Sil 5 CB
Column length (m) 25.
Carrier gas
Substrate
Column diameter (mm) 0.32
Phase thickness (μm) 0.45
Tstart (C) 0.
Tend (C) 300.
Heat rate (K/min) 3.
Initial hold (min) 5.
Final hold (min) 10.
I 1320.
ReferenceHöld, Schouten, et al., 1998
Comment MSDC-RI

References

Höld, Schouten, et al., 1998
Höld, I.M.; Schouten, S.; van Kaam-Peters, H.M.E.; Sinninghe Damsté, J.S., Recognition of n-alkyl and isoprenoid algaenans in marine sediments by stable carbon isotopic analysis of pyrolysis products of kerogens, Org. Geochem., 1998, 28, 3-4, 179-194, https://doi.org/10.1016/S0146-6380(97)00130-7 . [all data]