Hexadecane, 5-ethyl

Van Den Dool and Kratz RI, non-polar column, temperature ramp

View large format table.

Column type Active phase I Reference Comment
CapillaryCross-Linked Methylsilicone1736.Khorasheh, Gray, et al., 19895. K/min; Tstart: 40. C; Tend: 300. C
CapillaryDB-11740.Khorasheh, Gray, et al., 198935. C @ 3. min, 3. K/min; Tend: 300. C

Normal alkane RI, non-polar column, temperature ramp

View large format table.

Column type Active phase I Reference Comment
CapillaryOV-11768.Ramaroson-Raonizafinimanana, Gaydou, et al., 199725. m/0.31 mm/0.15 μm, H2, 3. K/min; Tstart: 70. C; Tend: 220. C

References

Khorasheh, Gray, et al., 1989
Khorasheh, F.; Gray, M.R.; Selucky, M.L., Correlation for Kováts retention index of C9-C26 monoalkyl and polymethyl alkanes and alkenes, J. Chromatogr., 1989, 481, 1-16, https://doi.org/10.1016/S0021-9673(01)96747-0 . [all data]

Ramaroson-Raonizafinimanana, Gaydou, et al., 1997
Ramaroson-Raonizafinimanana, B.; Gaydou, E.M.; Bombarda, I., Hydrocarbons from three vanilla bean species: V. fragrans, V. madagascariensis, and V. tahitensis, J. Agric. Food Chem., 1997, 45, 7, 2542-2545, https://doi.org/10.1021/jf960927b . [all data]