Oxazole, 4-ethyl-2-methyl

Kovats' RI, non-polar column, isothermal

View large format table.

Column type Active phase Temperature (C) I Reference Comment
CapillaryOV-101110.820.Zhuravleva, Shenderyuk, et al., 199050. m/0.30 mm/0.40 μm, He
CapillaryOV-101110.820.Golovnya, Shenderyuk, et al., 198940. m/0.28 mm/0.40 μm, He

Kovats' RI, polar column, isothermal

View large format table.

Column type Active phase Temperature (C) I Reference Comment
CapillaryPEG-40M110.1171.Golovnya, Shenderyuk, et al., 1991He; Column length: 50. m; Column diameter: 0.30 mm
CapillaryPEG-40M110.1171.Zhuravleva, Shenderyuk, et al., 199050. m/0.30 mm/0.40 μm, He
CapillaryPEG-40M110.1171.Golovnya, Shenderyuk, et al., 198947. m/0.30 mm/0.40 μm, He

Van Den Dool and Kratz RI, non-polar column, temperature ramp

View large format table.

Column type Active phase I Reference Comment
CapillarySPD-1807.Carlin, Jin, et al., 198650. C @ 5. min, 2. K/min, 280. C @ 30. min; Column length: 60. m; Column diameter: 0.25 mm

References

Zhuravleva, Shenderyuk, et al., 1990
Zhuravleva, I.L.; Shenderyuk, V.V.; Yakush, E.V.; Golovnya, R.V., Calculation of retention indexes of alkyloxazoles and alkylthiazoles in capillary chromatography, Bull. Acad. Sci. USSR, Div. Chem. Sci. (Engl. Transl.), 1990, 6, 6, 1204-1210, https://doi.org/10.1007/BF00962384 . [all data]

Golovnya, Shenderyuk, et al., 1989
Golovnya, R.V.; Shenderyuk, V.V.; Zhuravleva, I.L.; Yakush, E.V., Use of a principle of non-additivity of sorption energies for calculation of retention indices of alkyloxazoles in capillary chromatography, Zh. Anal. Khim., 1989, 44, 2037-2042. [all data]

Golovnya, Shenderyuk, et al., 1991
Golovnya, R.V.; Shenderyuk, V.V.; Zhuravleva, I.L.; Yakush, E.V., Analogy of sorption properties of alkylthiazoles and alkyl-oxazoles and its use for the calculation of retention indexes in capillary gas chromatography, Zh. Anal. Khim., 1991, 46, 2, 313-319. [all data]

Carlin, Jin, et al., 1986
Carlin, J.T.; Jin, Q.Z.; Huang, T.-C.; Ho, C.-T.; Chang, S.S., Identification of alkyloxazoles, in the volatile compounds from french-fried potatoes, J. Agric. Food Chem., 1986, 34, 4, 621-623, https://doi.org/10.1021/jf00070a008 . [all data]