Psicose, acyclic, TMS

Kovats' RI, non-polar column, isothermal

View large format table.

Column type Active phase Temperature (C) I Reference Comment
CapillarySE-54180.1838.García-Raso, Martínez-Castro, et al., 1987Column length: 40. m; Column diameter: 0.18 mm

Kovats' RI, non-polar column, temperature ramp

View large format table.

Column type Active phase I Reference Comment
CapillaryDB-5MS1872.Medeiros and Simoneit, 200730. m/0.25 mm/0.25 μm, He, 65. C @ 2. min, 6. K/min, 300. C @ 15. min

Kovats' RI, polar column, isothermal

View large format table.

Column type Active phase Temperature (C) I Reference Comment
CapillaryFFAP170.1869.Garcia-Raso, Fernandez-Diaz, et al., 1989Column length: 24. m; Column diameter: 0.22 mm

References

García-Raso, Martínez-Castro, et al., 1987
García-Raso, A.; Martínez-Castro, I.; Páez, M.I.; Sanz, J.; García-Raso, J.; Saura-Calixto, F., Gas Chromatographic Behaviour of Carbohydrate Trimethylsilyl Ethers. I. Aldopentoses, J. Chromatogr., 1987, 398, 9-20, https://doi.org/10.1016/S0021-9673(01)96491-X . [all data]

Medeiros and Simoneit, 2007
Medeiros, P.M.; Simoneit, B.R.T., Analysis of sugars in environmental samples by gas chromatography-mass spectrometry, J. Chromatogr. A, 2007, 1141, 2, 271-278, https://doi.org/10.1016/j.chroma.2006.12.017 . [all data]

Garcia-Raso, Fernandez-Diaz, et al., 1989
Garcia-Raso, A.; Fernandez-Diaz, M.; Paez, M.I.; Sanz, J.; Martinez-Castro, I., Gas Chromatographic Retention of Carbohydrate Trimethylsilyl Ethers. III. Ketohexoses, J. Chromatogr., 1989, 471, 205-216, https://doi.org/10.1016/S0021-9673(00)94168-2 . [all data]