B-Sorbopyranose, TMS

Kovats' RI, polar column, isothermal

Data compiled by: NIST Mass Spectrometry Data Center, William E. Wallace, director

Column type Capillary
Active phase FFAP
Column length (m) 24.
Carrier gas
Substrate
Column diameter (mm) 0.22
Phase thickness (μm)
Temperature (C) 170.
I 1757.
ReferenceGarcia-Raso, Fernandez-Diaz, et al., 1989
Comment MSDC-RI

References

Garcia-Raso, Fernandez-Diaz, et al., 1989
Garcia-Raso, A.; Fernandez-Diaz, M.; Paez, M.I.; Sanz, J.; Martinez-Castro, I., Gas Chromatographic Retention of Carbohydrate Trimethylsilyl Ethers. III. Ketohexoses, J. Chromatogr., 1989, 471, 205-216, https://doi.org/10.1016/S0021-9673(00)94168-2 . [all data]