A-Tagatofuranose, TMS

Kovats' RI, polar column, isothermal

View large format table.

Column type Active phase Temperature (C) I Reference Comment
CapillaryFFAP170.1721.Garcia-Raso, Fernandez-Diaz, et al., 1989Column length: 24. m; Column diameter: 0.22 mm

References

Garcia-Raso, Fernandez-Diaz, et al., 1989
Garcia-Raso, A.; Fernandez-Diaz, M.; Paez, M.I.; Sanz, J.; Martinez-Castro, I., Gas Chromatographic Retention of Carbohydrate Trimethylsilyl Ethers. III. Ketohexoses, J. Chromatogr., 1989, 471, 205-216, https://doi.org/10.1016/S0021-9673(00)94168-2 . [all data]