Benzaldehyde, 3,4-dichloro-2-hydroxy

Kovats' RI, non-polar column, isothermal

View large format table.

Column type Active phase Temperature (C) I Reference Comment
CapillarySE-30160.1434.Evans and Haken, 1989Column length: 25. m; Column diameter: 0.32 mm
CapillarySE-30140.1413.Korhonen, 1984Column length: 25. m; Column diameter: 0.3 mm
CapillarySE-30160.1434.Korhonen, 1984Column length: 25. m; Column diameter: 0.3 mm
CapillarySE-30180.1451.Korhonen, 1984Column length: 25. m; Column diameter: 0.3 mm

Kovats' RI, polar column, isothermal

View large format table.

Column type Active phase Temperature (C) I Reference Comment
CapillaryOV-351160.2426.Evans and Haken, 1989Column length: 25. m; Column diameter: 0.32 mm
CapillaryOV-351160.2426.Korhonen, 1984Column length: 25. m; Column diameter: 0.32 mm

Van Den Dool and Kratz RI, non-polar column, temperature ramp

View large format table.

Column type Active phase I Reference Comment
CapillarySE-301426.Korhonen, 198410. K/min; Column length: 25. m; Column diameter: 0.3 mm; Tstart: 100. C
CapillarySE-301398.Korhonen, 19842. K/min; Column length: 25. m; Column diameter: 0.3 mm; Tstart: 100. C
CapillarySE-301419.Korhonen, 19846. K/min; Column length: 25. m; Column diameter: 0.3 mm; Tstart: 100. C

Van Den Dool and Kratz RI, polar column, temperature ramp

View large format table.

Column type Active phase I Reference Comment
CapillaryOV-3512459.Korhonen, 198410. K/min; Column length: 25. m; Column diameter: 0.32 mm; Tstart: 100. C
CapillaryOV-3512413.Korhonen, 19846. K/min; Column length: 25. m; Column diameter: 0.32 mm; Tstart: 100. C

Normal alkane RI, non-polar column, custom temperature program

View large format table.

Column type Active phase I Reference Comment
CapillaryMethyl Silicone1434.Feng, Yue, et al., 2006Program: not specified

References

Evans and Haken, 1989
Evans, M.B.; Haken, J.K., Dispersion and selectivity indices in gas chromatography. IV. Chlorinated aromatic compounds, J. Chromatogr., 1989, 468, 373-382, https://doi.org/10.1016/S0021-9673(00)96332-5 . [all data]

Korhonen, 1984
Korhonen, I.O.O., Gas-liquid chromatographic analyses. XXX. Separation and retention increments of chlorinated salicylaldehydes (2-hydroxybenzaldehydes ) on low-polarity (SE-30) and polar (OV-351) capillary columns, J. Chromatogr., 1984, 298, 101-114, https://doi.org/10.1016/S0021-9673(01)92698-6 . [all data]

Feng, Yue, et al., 2006
Feng, C.-J.; Yue, W.; Li, M.-J., Estimation of chromatographic retention index of chlorinated hydroxybenzaldehyde by correlation indexes, Chem. Ind. Engineering, 2006, 23, 6, 486-490. [all data]