trans-3,5-dimethyl-1,2,4-trithiolane

Van Den Dool and Kratz RI, polar column, custom temperature program

Data compiled by: NIST Mass Spectrometry Data Center, William E. Wallace, director

Column type Capillary
Active phase CP-Wax 52CB
Column length (m) 50.
Carrier gas
Substrate
Column diameter (mm) 0.32
Phase thickness (μm) 0.21
Program 0C(5min) => fast => 60C(5min) => 4C/min => 220C(20min)
I 1580.
ReferenceMadruga and Mottram, 1998
Comment MSDC-RI

Kovats' RI, non-polar column, isothermal

Data compiled by: NIST Mass Spectrometry Data Center, William E. Wallace, director

Column type Packed
Active phase Apiezon M
Column length (m) 2.1
Carrier gas He or N2
Substrate Chromosorb W, AW-DMCS
Column diameter (mm)
Phase thickness (μm)
Temperature (C) 130.
I 1175.
ReferenceGarbuzov, Misharina, et al., 1985
Comment MSDC-RI

Van Den Dool and Kratz RI, non-polar column, temperature ramp

View large format table.

Column type Active phase I Reference Comment
CapillaryCP Sil 8 CB1134.Mahadevan and Farmer, 200660. C @ 5. min, 4. K/min, 220. C @ 30. min; Column length: 50. m; Column diameter: 0.32 mm
CapillaryBPX-51169.Bredie, Mottram, et al., 200250. m/0.32 mm/0.5 μm, 60. C @ 5. min, 4. K/min, 250. C @ 20. min
CapillaryBPX-51177.Bredie, Mottram, et al., 200250. m/0.32 mm/0.5 μm, 60. C @ 5. min, 4. K/min, 250. C @ 20. min
CapillaryBP-51138.Whitfield and Mottram, 20014. K/min; Column length: 50. m; Column diameter: 0.32 mm; Tstart: 60. C; Tend: 250. C
CapillaryDB-51140.Madruga and Mottram, 199830. m/0.32 mm/1. μm, 60. C @ 5. min, 4. K/min, 250. C @ 20. min
CapillaryDB-11101.Zhang and Ho, 198960. m/0.25 mm/0.25 μm, He, 2. K/min, 220. C @ 10. min; Tstart: 40. C
CapillaryDB-11101.Zhang, Chien, et al., 198860. m/0.25 mm/0.25 μm, He, 2. K/min, 220. C @ 10. min; Tstart: 40. C

Van Den Dool and Kratz RI, polar column, temperature ramp

View large format table.

Column type Active phase I Reference Comment
CapillaryCP-Wax 52CB1600.Mahadevan and Farmer, 200660. C @ 5. min, 4. K/min, 220. C @ 30. min; Column length: 50. m; Column diameter: 0.32 mm
CapillaryCP-Wax 52CB1593.Liu, Yang, et al., 2001H2, 2. K/min; Column length: 50. m; Column diameter: 0.32 mm; Tstart: 50. C; Tend: 200. C

Normal alkane RI, non-polar column, temperature ramp

View large format table.

Column type Active phase I Reference Comment
CapillaryDB-51161.Macku and Shibamoto, 1991He, 40. C @ 5. min, 2. K/min; Column length: 60. m; Column diameter: 0.25 mm; Tend: 160. C

Normal alkane RI, polar column, temperature ramp

View large format table.

Column type Active phase I Reference Comment
CapillaryPEG-20M1568.Kubota, Nakamoto, et al., 1991N2, 2. K/min; Column length: 50. m; Column diameter: 0.25 mm; Tstart: 60. C; Tend: 180. C

References

Madruga and Mottram, 1998
Madruga, M.S.; Mottram, D.S., The effect of pH on the formation of volatile compounds produced by heating a model system containing 5'-imp and cysteine, J. Braz. Chem. Soc., 1998, 9, 3, 261-271, https://doi.org/10.1590/S0103-50531998000300010 . [all data]