1,2,3,5,6-Pentathiepane, 4,7-dimethyl, #2

Van Den Dool and Kratz RI, non-polar column, temperature ramp

Data compiled by: NIST Mass Spectrometry Data Center, William E. Wallace, director

Column type CapillaryCapillary
Active phase DB-1DB-1
Column length (m) 60.60.
Carrier gas HeHe
Substrate
Column diameter (mm) 0.250.25
Phase thickness (μm) 0.250.25
Tstart (C) 40.40.
Tend (C) 220.220.
Heat rate (K/min) 2.2.
Initial hold (min)
Final hold (min) 10.10.
I 1628.1628.
ReferenceZhang and Ho, 1989Zhang, Chien, et al., 1988
Comment MSDC-RI MSDC-RI

References

Zhang and Ho, 1989
Zhang, Y.; Ho, C.-T., Volatile compounds formed from thermnal interaction of 2,4-decadienal with cysteine and glutathione, J. Agric. Food Chem., 1989, 37, 4, 1016-1020, https://doi.org/10.1021/jf00088a044 . [all data]

Zhang, Chien, et al., 1988
Zhang, Y.; Chien, M.; Ho.C.-T., Comparison of the volatile compounds obtained from thermal degradation of cysteine and glutathione in water, J. Agric. Food Chem., 1988, 36, 5, 992-996, https://doi.org/10.1021/jf00083a022 . [all data]