5-Hydroxyadamantan-2-one

Normal alkane RI, non-polar column, isothermal

Data compiled by: NIST Mass Spectrometry Data Center, William E. Wallace, director

Column type CapillaryCapillaryCapillaryCapillaryCapillary
Active phase OV-101OV-101OV-101OV-101OV-101
Column length (m) 50.50.50.50.50.
Carrier gas    NitrogenNitrogen
Substrate
Column diameter (mm) 0.250.250.250.250.25
Phase thickness (μm)
Temperature (C) 200.210.220.200.210.
I 1516.1525.1531.1516.1525.
ReferenceTriska and Vodicka, 1991Triska and Vodicka, 1991Triska and Vodicka, 1991Vodicka, Triska, et al., 1986Vodicka, Triska, et al., 1986
Comment MSDC-RI MSDC-RI MSDC-RI MSDC-RI MSDC-RI

References

Triska and Vodicka, 1991
Triska, J.; Vodicka, L., Characterization of ditopic oxygen-containing adamantane derivatives by capillary gas chromatography and thin-layer chromatography, Sbornik Vysoke Skoly Chemisco-Techlogicke v Praze, 1991, D59, 91-100. [all data]

Vodicka, Triska, et al., 1986
Vodicka, L.; Triska, J.; Hlavaty, J., Characterization of oxygen-containing qdqmqntane derivatives by parillary gas chromatography, J. Chromatogr., 1986, 366, 382-384, https://doi.org/10.1016/S0021-9673(01)93487-9 . [all data]