(+)-β-Funebrene

Van Den Dool and Kratz RI, non-polar column, temperature ramp

Data compiled by: NIST Mass Spectrometry Data Center, William E. Wallace, director

Column type Capillary
Active phase HP-5MS
Column length (m) 30.
Carrier gas He
Substrate
Column diameter (mm) 0.25
Phase thickness (μm) 0.25
Tstart (C) 60.
Tend (C) 280.
Heat rate (K/min) 4.
Initial hold (min) 5.
Final hold (min)
I 1415.
ReferenceSaroglou, Marin, et al., 2007
Comment MSDC-RI

References

Saroglou, Marin, et al., 2007
Saroglou, V.; Marin, P.D.; Rancic, A.; Veljic, M.; Skaltsa, H., Composition and antimicrobial activity of the essential oil of six Hypericum species from Serbia, Biochem. Syst. Ecol., 2007, 35, 3, 146-152, https://doi.org/10.1016/j.bse.2006.09.009 . [all data]