Nerolidol oxide

Van Den Dool and Kratz RI, non-polar column, temperature ramp

View large format table.

Column type Active phase I Reference Comment
CapillaryHP-5MS1640.Saroglou, Arfan, et al., 200730. m/0.25 mm/0.25 μm, He, 60. C @ 5. min, 4. K/min; Tend: 280. C

Normal alkane RI, non-polar column, temperature ramp

View large format table.

Column type Active phase I Reference Comment
CapillaryDB-51564.Limberger, Sobral, et al., 200530. m/0.25 mm/0.25 μm, He, 3. K/min; Tstart: 60. C; Tend: 230. C

References

Saroglou, Arfan, et al., 2007
Saroglou, V.; Arfan, M.; Shabir, A.; Hadjipavlou-Litina, D.; Skaltsa, H., Composition and antioxidant activity of the essential oil of Teucrium royleanum Wall. ex Benth growing in Pakistan, Flavour Fragr. J., 2007, 22, 2, 154-157, https://doi.org/10.1002/ffj.1774 . [all data]

Limberger, Sobral, et al., 2005
Limberger, R.P.; Sobral, M.; Henriques, A.T., Intraspecific volatile oil variation in Myrceugenia cucullata (Myrtaceae), Biochem. Syst. Ecol., 2005, 33, 3, 287-293, https://doi.org/10.1016/j.bse.2004.10.002 . [all data]