Fucose, tetrakis-TMS

Kovats' RI, non-polar column, temperature ramp

View large format table.

Column type Active phase I Reference Comment
CapillaryDB-5MS1740.Medeiros and Simoneit, 200730. m/0.25 mm/0.25 μm, He, 65. C @ 2. min, 6. K/min, 300. C @ 15. min

Normal alkane RI, non-polar column, temperature ramp

View large format table.

Column type Active phase I Reference Comment
CapillaryHP-51704.Isidorov, Lech, et al., 200830. m/0.25 mm/0.25 μm, Helium, 3. K/min, 300. C @ 30. min; Tstart: 50. C
CapillaryHP-51700.Isidorov, Kotowska, et al., 200530. m/0.25 mm/0.25 μm, He, 5. K/min; Tstart: 50. C; Tend: 300. C

References

Medeiros and Simoneit, 2007
Medeiros, P.M.; Simoneit, B.R.T., Analysis of sugars in environmental samples by gas chromatography-mass spectrometry, J. Chromatogr. A, 2007, 1141, 2, 271-278, https://doi.org/10.1016/j.chroma.2006.12.017 . [all data]

Isidorov, Lech, et al., 2008
Isidorov, V.A.; Lech, P.; Zolciak, A.; Rusak, N.; Szczepaniak, L., Gas Chromatographic - nass spectrometric investigation of metabolites from the needles and roots of pine seedlings at early stages of pathogenic fungi Armillaria ostoyae attack, Trees, 2008, 22, 4, 531-542, https://doi.org/10.1007/s00468-008-0213-z . [all data]

Isidorov, Kotowska, et al., 2005
Isidorov, V.A.; Kotowska, U.; Vinogorova, V.T., GC Identification of organic compounds based on partition coefficients of their TMS derivatives in a hexane-acetonitrile system and retention indices, Anal. Sci., 2005, 21, 12, 1483-1489, https://doi.org/10.2116/analsci.21.1483 . [all data]