Triamcinolone, 20-hydroxy, MO TMS

Normal alkane RI, non-polar column, temperature ramp

View large format table.

Column type Active phase I Reference Comment
CapillaryCross-Linked Methylsilicone3493.Rodchenkov, Uralets, et al., 198810. m/0.20 mm/0.11 μm, He, 220. C @ 2. min, 2. K/min, 270. C @ 15. min

References

Rodchenkov, Uralets, et al., 1988
Rodchenkov, G.M.; Uralets, V.P.; Semenov, V.A.; Leclercq, P.A., Analysis of Dexamethasone, Triamcinolone, and Their Metabolites in Human Urine by Microcolumn Liquid and Capillary Gas Chromatography Mass Spectrometry, J. Hi. Res. Chromatogr. Chromatogr. Comm., 1988, 11, 3, 283-288, https://doi.org/10.1002/jhrc.1240110312 . [all data]