β-D(-)-Erythrose, TMS

Kovats' RI, non-polar column, temperature ramp

View large format table.

Column type Active phase I Reference Comment
CapillaryDB-5MS1443.Medeiros and Simoneit, 200730. m/0.25 mm/0.25 μm, He, 65. C @ 2. min, 6. K/min, 300. C @ 15. min

References

Medeiros and Simoneit, 2007
Medeiros, P.M.; Simoneit, B.R.T., Analysis of sugars in environmental samples by gas chromatography-mass spectrometry, J. Chromatogr. A, 2007, 1141, 2, 271-278, https://doi.org/10.1016/j.chroma.2006.12.017 . [all data]