Incisol

Kovats' RI, non-polar column, custom temperature program

View large format table.

Column type Active phase I Reference Comment
CapillaryHP-51540.de Marchese, de Heluani, et al., 2007He; Program: 60C(5min) => 3C/min => 100C => 1C/min => 160C => 10C/min => 240C(10min)

References

de Marchese, de Heluani, et al., 2007
de Marchese, M.J.A.; de Heluani, C.S.; Catalán, C.A.N.; Griffin, C.A.; Vaughn, J.B., Jr.; Herz, W., Incisol, an alcohol with a novel sesquiterpene skeleton from Xenophyllum incisum, Biochem. Syst. Ecol., 2007, 35, 3, 169-175, https://doi.org/10.1016/j.bse.2006.10.006 . [all data]