Methyl isopulegone

Normal alkane RI, non-polar column, custom temperature program

View large format table.

Column type Active phase I Reference Comment
CapillarySPB-11464.Díaz-Maroto, Castillo, et al., 200750. m/0.25 mm/0.25 μm; Program: 70C(3min) => 4C/min => 120C => 8C/min => 250C(5min)

References

Díaz-Maroto, Castillo, et al., 2007
Díaz-Maroto, M.C.; Castillo, N.; Castro-Vázquez, L.; González-Viñas, M.A.; Pérez-Coello, M.S., Volatile composition and olfactory profile of pennyroyal (Mentha pulegium L.) plants, Flavour Fragr. J., 2007, 22, 2, 114-118, https://doi.org/10.1002/ffj.1766 . [all data]