Humulene-6,7-oxide

Van Den Dool and Kratz RI, non-polar column, temperature ramp

View large format table.

Column type Active phase I Reference Comment
CapillaryBP-11598.Boti, Koukoua, et al., 200750. m/0.22 mm/0.25 μm, He, 2. K/min, 220. C @ 20. min; Tstart: 60. C

Van Den Dool and Kratz RI, polar column, temperature ramp

View large format table.

Column type Active phase I Reference Comment
CapillaryBP-202041.Boti, Koukoua, et al., 200750. m/0.22 mm/0.25 μm, He, 2. K/min, 220. C @ 20. min; Tstart: 60. C

References

Boti, Koukoua, et al., 2007
Boti, J.B.; Koukoua, G.; N'Guessan, T.Y.; Casanova, J., Chemical variability of Conyza sumatrensis and Microglossa pyrifolia from Côte d'Ivoire, Flavour Fragr. J., 2007, 22, 1, 27-31, https://doi.org/10.1002/ffj.1743 . [all data]