Cedranol

Van Den Dool and Kratz RI, non-polar column, temperature ramp

View large format table.

Column type Active phase I Reference Comment
CapillaryHP-51633.Zhao J.Y., Liu J.M., et al., 200630. m/0.25 mm/0.25 μm, He, 60. C @ 2. min, 10. K/min, 250. C @ 10. min

References

Zhao J.Y., Liu J.M., et al., 2006
Zhao J.Y.; Liu J.M.; Zhang X.Y.; Liu Z.J.; Tsering T.; Zhong Y.; Nan P., Chemical composition of the volatiles of three wild Bergenia species from western China, Flavour Fragr. J., 2006, 21, 3, 431-434, https://doi.org/10.1002/ffj.1689 . [all data]