Eudesma-4,11-dien-2-ol

Van Den Dool and Kratz RI, non-polar column, temperature ramp

View large format table.

Column type Active phase I Reference Comment
CapillaryHP-5MS1691.Vujisic L., Vuckovic I., et al., 200630. m/0.25 mm/0.25 μm, H2, 4.3 K/min; Tstart: 50. C; Tend: 285. C

References

Vujisic L., Vuckovic I., et al., 2006
Vujisic L.; Vuckovic I.; Tesevic V.; Dokovic D.; Ristic M.S.; Janackovic P.; Milosavljevic S., Comparative examination of the essential oils of Anthemis ruthenica and A-arvensis wild-growing in Serbia, Flavour Fragr. J., 2006, 21, 3, 458-461, https://doi.org/10.1002/ffj.1681 . [all data]