Furfuryl propyl sulfide

Kovats' RI, non-polar column, isothermal

Data compiled by: NIST Mass Spectrometry Data Center, William E. Wallace, director

Column type CapillaryCapillaryCapillary
Active phase OV-101OV-101OV-101
Column length (m) 50.50.50.
Carrier gas
Substrate
Column diameter (mm) 0.320.320.32
Phase thickness (μm)
Temperature (C) 120.130.140.
I 1158.1161.1165.
ReferenceMisharina, Aerov, et al., 1988Misharina, Aerov, et al., 1988Misharina, Aerov, et al., 1988
Comment MSDC-RI MSDC-RI MSDC-RI

References

Misharina, Aerov, et al., 1988
Misharina, T.A.; Aerov, A.F.; Golovnya, R.V.; Stepanova, O.V.; Vysotskaya, L.E.; Gren, A.I., Retention indices of alkylfurfurylsulfides in isothermal and temperature-programmed capillary chromatography, Zh. Anal. Khim., 1988, 43, 8, 1489-1493. [all data]