HEXADECANOIC ACID-13C4-TMS

Van Den Dool and Kratz RI, non-polar column, temperature ramp

Data compiled by: NIST Mass Spectrometry Data Center, William E. Wallace, director

Column type Capillary
Active phase DB-5MS
Column length (m) 15.
Carrier gas
Substrate
Column diameter (mm) 0.18
Phase thickness (μm) 0.18
Tstart (C) 70.
Tend (C) 320.
Heat rate (K/min) 40.
Initial hold (min) 2.
Final hold (min) 1.
I 2043.
ReferenceUmeå Plant Science Centre, 2006
Comment MSDC-RI

References

Umeå Plant Science Centre, 2006
Umeå Plant Science Centre, The Metabolomics facility, RTI data. Compound identification, 2006, retrieved from http://www.upsc.se/metabolomics.htm. [all data]