Arabinose, MO-TMS

Van Den Dool and Kratz RI, non-polar column, temperature ramp

View large format table.

Column type Active phase I Reference Comment
CapillaryDB-5MS1658.Umeå Plant Science Centre, 200615. m/0.18 mm/0.18 μm, 70. C @ 2. min, 40. K/min, 320. C @ 1. min

Normal alkane RI, non-polar column, isothermal

View large format table.

Column type Active phase Temperature (C) I Reference Comment
CapillaryOV-101175.1680.Zegota, 1980Column length: 50. m; Column diameter: 0.30 mm
CapillarySE-30165.1690.Zegota, 198035; Column diameter: 0.30 mm

References

Umeå Plant Science Centre, 2006
Umeå Plant Science Centre, The Metabolomics facility, RTI data. Compound identification, 2006, retrieved from http://www.upsc.se/metabolomics.htm. [all data]

Zegota, 1980
Zegota, H., Separation and quantitative determination of fructose as the O-methyloxime by gas-liquid chromatography using glass capillary columns, J. Chromatogr., 1980, 192, 2, 446-451, https://doi.org/10.1016/S0021-9673(80)80024-0 . [all data]