Ethyl furfuryl sulfide

Kovats' RI, non-polar column, isothermal

Data compiled by: NIST Mass Spectrometry Data Center, William E. Wallace, director

Column type CapillaryCapillaryCapillaryPacked
Active phase OV-101OV-101OV-101Apiezon M
Column length (m) 50.50.50.2.1
Carrier gas
Substrate    Chromosorb W, AW/DMS
Column diameter (mm) 0.320.320.32
Phase thickness (μm)
Temperature (C) 120.130.140.130.
I 1067.1069.1071.1058.
ReferenceMisharina, Aerov, et al., 1988Misharina, Aerov, et al., 1988Misharina, Aerov, et al., 1988Golovnya, Garbuzov, et al., 1978
Comment MSDC-RI MSDC-RI MSDC-RI MSDC-RI

References

Misharina, Aerov, et al., 1988
Misharina, T.A.; Aerov, A.F.; Golovnya, R.V.; Stepanova, O.V.; Vysotskaya, L.E.; Gren, A.I., Retention indices of alkylfurfurylsulfides in isothermal and temperature-programmed capillary chromatography, Zh. Anal. Khim., 1988, 43, 8, 1489-1493. [all data]

Golovnya, Garbuzov, et al., 1978
Golovnya, R.V.; Garbuzov, V.G.; Aerov, A.F., Gas chromatographic characterization of sulfur-containing compounds. 5. Thiophene, furan, and benzene derivatives, Izv. Akad. Nauk SSSR Ser. Khim., 1978, 11, 2271-2274. [all data]