furan linalyloxide β-D-glucopyranoside ( E/ Z), TFA

Van Den Dool and Kratz RI, non-polar column, temperature ramp

Data compiled by: NIST Mass Spectrometry Data Center, William E. Wallace, director

Column type Capillary
Active phase DB-5MS
Column length (m) 30.
Carrier gas He
Substrate
Column diameter (mm) 0.25
Phase thickness (μm) 0.25
Tstart (C) 125.
Tend (C) 290.
Heat rate (K/min) 3.
Initial hold (min) 2.
Final hold (min) 30.
I 1764.
ReferenceUgliano, Bartowsky, et al., 2006
Comment MSDC-RI

References

Ugliano, Bartowsky, et al., 2006
Ugliano, M.; Bartowsky, E.J.; McCarthy, J.; Moio, L.; Henschke, P.A., Hydrolysis and Transformation of Grape Glycosidically Bound Volatile Compounds during Fermentation with Three Saccharomyces Yeast Strains, J. Agric. Food Chem., 2006, 54, 17, 6322-6331, https://doi.org/10.1021/jf0607718 . [all data]