Zizanene

Normal alkane RI, polar column, custom temperature program

Data compiled by: NIST Mass Spectrometry Data Center, William E. Wallace, director

Column type Capillary
Active phase Innowax FSC
Column length (m) 60.
Carrier gas He
Substrate
Column diameter (mm) 0.25
Phase thickness (μm) 0.25
Program 60C(10min) => 4C/min => 220C (10min) => 1C/min => 240C
I 1705.
ReferenceTosun, Kürkcüoglu, et al., 2006
Comment MSDC-RI

References

Tosun, Kürkcüoglu, et al., 2006
Tosun, A.; Kürkcüoglu, M.; Dogan, E.; Duman, H.; Baser, K.H.C., Essential oil composition of Seseli petraeum M. Bieb. and Seseli andronakii Woron. growing in Turkey, Flavour Fragr. J., 2006, 21, 2, 257-259, https://doi.org/10.1002/ffj.1572 . [all data]